Target
T cell receptor alpha variable 4
Ligand
BDBM96397
Substrate
IC50
>94031±n/a nM
Citation
 PubChem, PC Fluorescence-based biochemical primary high throughput dose response assay to identify inhibitors of T-cell receptor (TCR)-CD3 interaction using a TAMRA-labeled TCR probe PubChem Bioassay (2013)[AID] 
Target
Name:
T cell receptor alpha variable 4
Synonyms:
TCRAV4S1 TVA4_HUMAN
Type:
Enzyme Catalytic Domain
Mol. Mass.:
12216.28
Organism:
Homo sapiens (Human)
Description:
A0A0B4J268
Residue:
109
  
Inhibitor
Name:
BDBM96397
Synonyms:
MLS001080222 N-[2-[2-(2-hydroxyphenyl)carbonylhydrazinyl]-2-oxidanylidene-ethyl]-3-methyl-benzamide N-[2-keto-2-(N'-salicyloylhydrazino)ethyl]-3-methyl-benzamide cid_7535118
Type:
Small organic molecule
Emp. Form.:
C17H17N3O4
Mol. Mass.:
327.3346
SMILES:
Cc1cccc(c1)C(=O)NCC(=O)NNC(=O)c1ccccc1O
: