Target
T cell receptor alpha variable 4
Ligand
BDBM96403
Substrate
IC50
32528±n/a nM
Citation
 PubChem, PC Fluorescence-based biochemical primary high throughput dose response assay to identify inhibitors of T-cell receptor (TCR)-CD3 interaction using a TAMRA-labeled TCR probe PubChem Bioassay (2013)[AID] 
Target
Name:
T cell receptor alpha variable 4
Synonyms:
TCRAV4S1 TVA4_HUMAN
Type:
Enzyme Catalytic Domain
Mol. Mass.:
12216.28
Organism:
Homo sapiens (Human)
Description:
A0A0B4J268
Residue:
109
  
Inhibitor
Name:
BDBM96403
Synonyms:
MLS002155592 N,N-dimethylformamide;2-[[4-[N'-[(Z)-(3-hydroxy-4-keto-cyclohexa-2,5-dien-1-ylidene)methyl]hydrazino]-3-nitro-phenyl]sulfonylamino]benzoic acid N,N-dimethylmethanamide;2-[[3-nitro-4-[2-[(Z)-(3-oxidanyl-4-oxidanylidene-cyclohexa-2,5-dien-1-ylidene)methyl]hydrazinyl]phenyl]sulfonylamino]benzoic acid cid_25162959
Type:
Small organic molecule
Emp. Form.:
C20H16N4O8S
Mol. Mass.:
472.428
SMILES:
OC(=O)c1ccccc1NS(=O)(=O)c1ccc(N=[NH+]Cc2ccc([O-])c(O)c2)c(c1)[N+]([O-])=O
: