Target
T cell receptor alpha variable 4
Ligand
BDBM50620
Substrate
IC50
44957±n/a nM
Citation
 PubChem, PC Fluorescence-based biochemical primary high throughput dose response assay to identify inhibitors of T-cell receptor (TCR)-CD3 interaction using a TAMRA-labeled TCR probe PubChem Bioassay (2013)[AID] 
Target
Name:
T cell receptor alpha variable 4
Synonyms:
TCRAV4S1 TVA4_HUMAN
Type:
Enzyme Catalytic Domain
Mol. Mass.:
12216.28
Organism:
Homo sapiens (Human)
Description:
A0A0B4J268
Residue:
109
  
Inhibitor
Name:
BDBM50620
Synonyms:
2-(2-furanyl)-4-quinolinecarboxylic acid [2-[(1,1-dioxo-3-thiolanyl)-methylamino]-2-oxoethyl] ester MLS000772718 [2-[(1,1-dioxothiolan-3-yl)-methylamino]-2-oxoethyl] 2-(furan-2-yl)quinoline-4-carboxylate cid_4008175
Type:
Small organic molecule
Emp. Form.:
C21H20N2O6S
Mol. Mass.:
428.458
SMILES:
CN(C1CCS(=O)(=O)C1)C(=O)COC(=O)c1cc(nc2ccccc12)-c1ccco1
: