Target
T cell receptor alpha variable 4
Ligand
BDBM84369
Substrate
IC50
16591±n/a nM
Citation
 PubChem, PC Fluorescence-based biochemical primary high throughput dose response assay to identify inhibitors of T-cell receptor (TCR)-CD3 interaction using a TAMRA-labeled TCR probe PubChem Bioassay (2013)[AID] 
Target
Name:
T cell receptor alpha variable 4
Synonyms:
TCRAV4S1 TVA4_HUMAN
Type:
Enzyme Catalytic Domain
Mol. Mass.:
12216.28
Organism:
Homo sapiens (Human)
Description:
A0A0B4J268
Residue:
109
  
Inhibitor
Name:
BDBM84369
Synonyms:
6-chloranyl-7-[4-(2-hydroxyethyl)piperazin-1-yl]-5,8-bis(oxidanyl)naphthalene-1,4-dione;hydrochloride 6-chloro-5,8-dihydroxy-7-[4-(2-hydroxyethyl)piperazin-1-yl]naphthalene-1,4-dione;hydrochloride MLS002701603 cid_377971
Type:
Small organic molecule
Emp. Form.:
C16H17ClN2O5
Mol. Mass.:
352.77
SMILES:
OCCN1CCN(CC1)c1c(O)c2C(=O)C=CC(=O)c2c(O)c1Cl
: