Target
T cell receptor alpha variable 4
Ligand
BDBM96411
Substrate
IC50
>94022±n/a nM
Citation
 PubChem, PC Fluorescence-based biochemical primary high throughput dose response assay to identify inhibitors of T-cell receptor (TCR)-CD3 interaction using a TAMRA-labeled TCR probe PubChem Bioassay (2013)[AID] 
Target
Name:
T cell receptor alpha variable 4
Synonyms:
TCRAV4S1 TVA4_HUMAN
Type:
Enzyme Catalytic Domain
Mol. Mass.:
12216.28
Organism:
Homo sapiens (Human)
Description:
A0A0B4J268
Residue:
109
  
Inhibitor
Name:
BDBM96411
Synonyms:
MLS003170719 N'-[(E)-(3,5-dichloro-6-oxo-1-cyclohexa-2,4-dienylidene)methyl]-5-methyl-3-phenyl-4-isoxazolecarbohydrazide N'-[(E)-[3,5-bis(chloranyl)-6-oxidanylidene-cyclohexa-2,4-dien-1-ylidene]methyl]-5-methyl-3-phenyl-1,2-oxazole-4-carbohydrazide cid_5991589
Type:
Small organic molecule
Emp. Form.:
C18H13Cl2N3O3
Mol. Mass.:
390.22
SMILES:
Cc1onc(c1C(=O)NN=Cc1cc(Cl)cc(Cl)c1O)-c1ccccc1
: