Target
Albumin
Ligand
BDBM43104
Substrate
IC50
>94125±n/a nM
Citation
 PubChem, PC Counterscreen for inhibitors of T-cell receptor (TCR)-CD3 interaction: Fluorescence-based biochemical high throughput dose response assay to identify inhibitors of T-cell receptor (TCR)-CD3 interaction using a TAMRA-labeled BSA probe PubChem Bioassay (2013)[AID] 
Target
Name:
Albumin
Synonyms:
ALB Serum albumin | serum albumin precursor
Type:
PROTEIN
Mol. Mass.:
69288.15
Organism:
Bos taurus
Description:
ChEMBL_1502598
Residue:
607
  
Inhibitor
Name:
BDBM43104
Synonyms:
2-(3-bromophenyl)-4-quinolinecarboxylic acid [2-[3-(dimethylsulfamoyl)anilino]-2-oxoethyl] ester MLS000409164 [2-[3-(dimethylsulfamoyl)anilino]-2-oxoethyl] 2-(3-bromophenyl)quinoline-4-carboxylate cid_4173883
Type:
Small organic molecule
Emp. Form.:
C26H22BrN3O5S
Mol. Mass.:
568.439
SMILES:
CN(C)S(=O)(=O)c1cccc(NC(=O)COC(=O)c2cc(nc3ccccc23)-c2cccc(Br)c2)c1
: