Target
Probable global transcription activator SNF2L2
Ligand
BDBM50507
Substrate
EC50
91161±n/a nM
Citation
 PubChem, PC Luminescence-based cell-based high throughput dose response assay to identify activators of the function of SWI/SNF related, matrix associated, actin dependent regulator of chromatin, subfamily a, member 2 (SMARCA2, BRM) PubChem Bioassay (2013)[AID] 
Target
Name:
Probable global transcription activator SNF2L2
Synonyms:
ATP-dependent helicase SMARCA2 BRG1-associated factor 190B Protein brahma homolog SMCA2_HUMAN SNF2A SWI/SNF-related matrix-associated actin-dependent regulator of chromatin subfamily A member 2 | hBRM
Type:
Enzyme Catalytic Domain
Mol. Mass.:
181290.91
Organism:
Homo sapiens (Human)
Description:
P51531
Residue:
1590
  
Inhibitor
Name:
BDBM50507
Synonyms:
1-(1,1-diketo-4-tosyl-2,5-dihydrothiophen-3-yl)ethanone 1-[4-(4-methylphenyl)sulfonyl-1,1-dioxo-2,5-dihydrothiophen-3-yl]ethanone MLS000694854 cid_1485939
Type:
Small organic molecule
Emp. Form.:
C13H14O5S2
Mol. Mass.:
314.377
SMILES:
CC(=O)C1=C(CS(=O)(=O)C1)S(=O)(=O)c1ccc(C)cc1
: