Target
Probable global transcription activator SNF2L2
Ligand
BDBM97042
Substrate
EC50
91098±n/a nM
Citation
 PubChem, PC Luminescence-based cell-based high throughput dose response assay to identify activators of the function of SWI/SNF related, matrix associated, actin dependent regulator of chromatin, subfamily a, member 2 (SMARCA2, BRM) PubChem Bioassay (2013)[AID] 
Target
Name:
Probable global transcription activator SNF2L2
Synonyms:
ATP-dependent helicase SMARCA2 BRG1-associated factor 190B Protein brahma homolog SMCA2_HUMAN SNF2A SWI/SNF-related matrix-associated actin-dependent regulator of chromatin subfamily A member 2 | hBRM
Type:
Enzyme Catalytic Domain
Mol. Mass.:
181290.91
Organism:
Homo sapiens (Human)
Description:
P51531
Residue:
1590
  
Inhibitor
Name:
BDBM97042
Synonyms:
2-thiophenecarboxylic acid [2-[4-(2-acetamidoethyl)phenyl]-2-oxoethyl] ester SMR001239121 [2-[4-(2-acetamidoethyl)phenyl]-2-oxoethyl] thiophene-2-carboxylate thiophene-2-carboxylic acid [2-[4-(2-acetamidoethyl)phenyl]-2-keto-ethyl] ester
Type:
Small organic molecule
Emp. Form.:
C17H17NO4S
Mol. Mass.:
331.386
SMILES:
CC(=O)NCCc1ccc(cc1)C(=O)COC(=O)c1cccs1
: