Target
Steroidogenic factor 1
Ligand
BDBM49371
Substrate
IC50
>67541±n/a nM
Citation
 PubChem, PC Counterscreen for inhibitors of the orphan nuclear receptor subfamily 0, group B, member 1 (DAX1; NR0B1): Luminescence-based cell-based high throughput dose response assay for nonselective inhibitors/assay artifacts using AP2 mutant SF-1 (NR5A1) Transactivation Assay PubChem Bioassay (2013)[AID] 
Target
Name:
Steroidogenic factor 1
Synonyms:
AD4BP FTZF1 NR5A1 SF-1 STF-1 Steroid hormone receptor Ad4BP
Type:
Nuclear Hormone Receptor
Mol. Mass.:
51643.43
Organism:
Homo sapiens (Human)
Description:
Residue:
461
  
Inhibitor
Name:
BDBM49371
Synonyms:
1,4,5,6-Tetrahydro-cyclopentapyrazole-3-carboxylic acid (2-bromo-3-phenyl-allylidene)-hydrazide N-[(E)-[(E)-2-bromo-3-phenyl-prop-2-enylidene]amino]-1,4,5,6-tetrahydrocyclopenta[c]pyrazole-3-carboxamide N-[[(Z)-2-bromanyl-3-phenyl-prop-2-enylidene]amino]-1,4,5,6-tetrahydrocyclopenta[c]pyrazole-3-carboxamide N-[[(Z)-2-bromo-3-phenylprop-2-enylidene]amino]-1,4,5,6-tetrahydrocyclopenta[c]pyrazole-3-carboxamide cid_1097667
Type:
Small organic molecule
Emp. Form.:
C16H15BrN4O
Mol. Mass.:
359.22
SMILES:
BrC(C=NNC(=O)c1[nH]nc2CCCc12)=Cc1ccccc1
: