Target
cAMP and cAMP-inhibited cGMP 3',5'-cyclic phosphodiesterase 10A
Ligand
BDBM97523
Substrate
Meas. Tech.
Scintillation Proximity Assay (SPA)
pH
7.5±0
IC50
1±n/a nM
Citation
 Bleicher, KFlohr, AZbinden, KGKoerner, MKuhn, BPeters, JRodriguez-Sarmiento, RMVieira, E Nitrogen-containing heteroaryl derivatives US Patent  US8470820 Publication Date 6/25/2013 
Target
Name:
cAMP and cAMP-inhibited cGMP 3',5'-cyclic phosphodiesterase 10A
Synonyms:
3',5'-cyclic phosphodiesterase PDE10A Phosphodiesterase 10 (PDE10) | Phosphodiesterase 10A
Type:
Protein
Mol. Mass.:
88412.52
Organism:
Homo sapiens (Human)
Description:
Q9Y233
Residue:
1055
  
Inhibitor
Name:
BDBM97523
Synonyms:
Roche-Dataset for PDE10A, Compound 107 | US8470820, 34
Type:
Small organic molecule
Emp. Form.:
C22H22N8O2
Mol. Mass.:
430.4625
SMILES:
CCc1ccc(Nc2cncnc2)c(n1)C(=O)Nc1cc(nn1CCO)-c1ccccn1
: