Target
Isocitrate dehydrogenase [NADP] cytoplasmic [R132C]
Ligand
BDBM279854
Substrate
Meas. Tech.
In Vitro Assays for IDH1m (R132H or R132C)
pH
7.5±n/a
Temperature
298.15±n/a K
IC50
>1000±n/a nM
Comments
extracted
Citation
 Konteatis, ZDPopovici-Muller, JTravins, JMZahler, RCai, ZZhou, D Therapeutically active compounds and their methods of use US Patent  US10028961 Publication Date 7/24/2018 
Target
Name:
Isocitrate dehydrogenase [NADP] cytoplasmic [R132C]
Synonyms:
IDH1 IDH1(R132C) Isocitrate dehydrogenase (IDH1)(R132C) Isocitrate dehydrogenase [NADP] cytoplasmic (IDH1) (R132C) | PICD
Type:
Enzyme Catalytic Domain
Mol. Mass.:
46607.23
Organism:
Homo sapiens (Human)
Description:
O75874[R132C]
Residue:
414
  
Inhibitor
Name:
BDBM279854
Synonyms:
US10028961, Compound 1 US10946023, Compound 1
Type:
Small organic molecule
Emp. Form.:
C17H19F3N6
Mol. Mass.:
364.3682
SMILES:
FC(F)(F)c1cccc(n1)-c1nc(NCC2CC2)nc(NCC2CC2)n1
: