Target
High affinity nerve growth factor receptor
Ligand
BDBM50392792
Substrate
Meas. Tech.
Amplified Luminescent Proximity Assay
Temperature
298.15±n/a K
IC50
3±n/a nM
Comments
extracted
Citation
 Davies, AIoannidis, SLamb, MSu, MWang, TZhang, H 9-(pyrazol-3-yl)-9H-purine-2-amine and 3-(pyrazol-3-yl) -3H-imidazo[4,5-B] pyridin-5-amine derivatives and their use for the treatment of cancer US Patent  US8486966 Publication Date 7/16/2013 
Target
Name:
High affinity nerve growth factor receptor
Synonyms:
2.7.10.1 NTRK1 NTRK1_HUMAN Neurotrophic tyrosine kinase receptor type 1 Synonyms=MTC TRK1-transforming tyrosine kinase protein TRKA GN Trk-A Tropomyosin-related kinase A Tyrosine kinase receptor Tyrosine kinase receptor A Tyrosine kinase receptor A (Trk-A) gp140trk | p140-TrkA
Type:
Mol. Mass.:
87498.18
Organism:
Homo sapiens (Human)
Description:
P04629
Residue:
796
  
Inhibitor
Name:
BDBM50392792
Synonyms:
CHEMBL2151322 | US8486966, 7
Type:
Small organic molecule
Emp. Form.:
C19H20FN7O2
Mol. Mass.:
397.4062
SMILES:
CC(C)Oc1cc(n[nH]1)-n1cnc2ccc(N[C@@H](CO)c3ccc(F)cn3)nc12
: