Target
High affinity nerve growth factor receptor
Ligand
BDBM98022
Substrate
Meas. Tech.
Amplified Luminescent Proximity Assay
Temperature
298.15±n/a K
IC50
7250±n/a nM
Comments
extracted
Citation
 Davies, AIoannidis, SLamb, MSu, MWang, TZhang, H 9-(pyrazol-3-yl)-9H-purine-2-amine and 3-(pyrazol-3-yl) -3H-imidazo[4,5-B] pyridin-5-amine derivatives and their use for the treatment of cancer US Patent  US8486966 Publication Date 7/16/2013 
Target
Name:
High affinity nerve growth factor receptor
Synonyms:
2.7.10.1 NTRK1 NTRK1_HUMAN Neurotrophic tyrosine kinase receptor type 1 Synonyms=MTC TRK1-transforming tyrosine kinase protein TRKA GN Trk-A Tropomyosin-related kinase A Tyrosine kinase receptor Tyrosine kinase receptor A Tyrosine kinase receptor A (Trk-A) gp140trk | p140-TrkA
Type:
Mol. Mass.:
87498.18
Organism:
Homo sapiens (Human)
Description:
P04629
Residue:
796
  
Inhibitor
Name:
BDBM98022
Synonyms:
US8486966, 19
Type:
Small organic molecule
Emp. Form.:
C20H21FN10O2
Mol. Mass.:
452.4449
SMILES:
C[C@H](Nc1nc(C(=O)N2CCOCC2)c2ncn(-c3cc(C)[nH]n3)c2n1)c1ncc(F)cn1
: