Target
NH(3)-dependent NAD(+) synthetase
Ligand
BDBM98092
Substrate
Meas. Tech.
NADs HPLC Enzyme Assay
pH
8.5±0
Temperature
277.15±0 K
IC50
600000±0.0 nM
Citation
 Moro, WBYang, ZKane, TAZhou, QHarville, SBrouillette, CGBrouillette, WJ SAR studies for a new class of antibacterial NAD biosynthesis inhibitors. J Comb Chem 11:617-25 (2009)  
Target
Name:
NH(3)-dependent NAD(+) synthetase
Synonyms:
BAS1855 GBAA_1998 Nicotinamide adenine dinucleotide synthetase (NADs) | nadE
Type:
Enzyme
Mol. Mass.:
30092.16
Organism:
Bacillus anthracis
Description:
Q81RP3
Residue:
272
  
Inhibitor
Name:
BDBM98092
Synonyms:
1-(4-nitrophenyl)-3-[4-(o-tolylsulfonylamino)phenyl]urea | Compound ID 7{1,1}
Type:
Small organic molecule
Emp. Form.:
C20H18N4O5S
Mol. Mass.:
426.446
SMILES:
Cc1ccccc1S(=O)(=O)Nc1ccc(NC(=O)Nc2ccc(cc2)[N+]([O-])=O)cc1
: