Target
cAMP and cAMP-inhibited cGMP 3',5'-cyclic phosphodiesterase 10A
Ligand
BDBM98891
Substrate
Meas. Tech.
Enzyme Inhibition Assay
IC50
23.3±n/a nM
Citation
 Allen, JRHorne, DBHarrington, EHKaller, MRMonenschein, HNguyen, TTReichelt, ARzasa, RM Heteroaryloxyheterocyclyl compounds as PDE10 inhibitors US Patent  US8497265 Publication Date 7/30/2013 
Target
Name:
cAMP and cAMP-inhibited cGMP 3',5'-cyclic phosphodiesterase 10A
Synonyms:
PDE10_RAT Phosphodiesterase 10 Phosphodiesterase Type 10 (PDE10A) | Rat recombinant PDE10a (rPDE10a)
Type:
Enzyme
Mol. Mass.:
90160.88
Organism:
Rattus norvegicus (rat)
Description:
PDE10A was generated from the full-length recombinant rat clone transfected into Sf9 cells.
Residue:
794
  
Inhibitor
Name:
BDBM98891
Synonyms:
US8497265, 217 | US8497265, 239
Type:
Small organic molecule
Emp. Form.:
C22H25N5O2
Mol. Mass.:
391.4662
SMILES:
OCC1CCN(CC1)c1nccnc1OC1CN(C1)c1ccc2ccccc2n1
: