Target
Tyrosine-protein kinase ITK/TSK
Ligand
BDBM87948
Substrate
Meas. Tech.
ITK Inhibitor Binding Kinetics
IC50
<1000±n/a nM
Citation
 Jacobsen, EJBlinn, JRSpringer, JRHockerman, SL Heterocyclic ITK inhibitors for treating inflammation and cancer US Patent  US9695200 Publication Date 7/4/2017 
Target
Name:
Tyrosine-protein kinase ITK/TSK
Synonyms:
EMT ITK_HUMAN LYK Tyrosine-protein kinase ITK Tyrosine-protein kinase Lyk
Type:
Protein
Mol. Mass.:
71839.20
Organism:
Homo sapiens (Human)
Description:
Q08881
Residue:
620
  
Inhibitor
Name:
BDBM87948
Synonyms:
US9695200, 16
Type:
Small organic molecule
Emp. Form.:
C20H15N5O
Mol. Mass.:
341.366
SMILES:
C=CC(=O)Nc1cncc(c1)-c1cnc2[nH]cc(-c3ccncc3)c2c1
: