Target
Tyrosine-protein kinase ITK/TSK
Ligand
BDBM88391
Substrate
Meas. Tech.
ITK Inhibitor Binding Kinetics
IC50
<1000±n/a nM
Citation
 Jacobsen, EJBlinn, JRSpringer, JRHockerman, SL Heterocyclic ITK inhibitors for treating inflammation and cancer US Patent  US9695200 Publication Date 7/4/2017 
Target
Name:
Tyrosine-protein kinase ITK/TSK
Synonyms:
EMT ITK_HUMAN LYK Tyrosine-protein kinase ITK Tyrosine-protein kinase Lyk
Type:
Protein
Mol. Mass.:
71839.20
Organism:
Homo sapiens (Human)
Description:
Q08881
Residue:
620
  
Inhibitor
Name:
BDBM88391
Synonyms:
US9695200, 19
Type:
Small organic molecule
Emp. Form.:
C22H15N5O
Mol. Mass.:
365.3874
SMILES:
C=CC(=O)Nc1cc(cc(c1)-c1cnc2[nH]cc(-c3ccncc3)c2c1)C#N
: