Target
Tyrosine-protein kinase ITK/TSK
Ligand
BDBM98801
Substrate
Meas. Tech.
ITK Inhibitor Binding Kinetics
IC50
<1000±n/a nM
Citation
 Jacobsen, EJBlinn, JRSpringer, JRHockerman, SL Heterocyclic ITK inhibitors for treating inflammation and cancer US Patent  US9695200 Publication Date 7/4/2017 
Target
Name:
Tyrosine-protein kinase ITK/TSK
Synonyms:
EMT ITK_HUMAN LYK Tyrosine-protein kinase ITK Tyrosine-protein kinase Lyk
Type:
Protein
Mol. Mass.:
71839.20
Organism:
Homo sapiens (Human)
Description:
Q08881
Residue:
620
  
Inhibitor
Name:
BDBM98801
Synonyms:
US9695200, 35
Type:
Small organic molecule
Emp. Form.:
C18H16FN5O
Mol. Mass.:
337.3509
SMILES:
Fc1cc(ccn1)-c1c[nH]c2ncc(cc12)N1CC(C1)NC(=O)C=C
: