Target
Tyrosine-protein kinase ITK/TSK
Ligand
BDBM98805
Substrate
Meas. Tech.
ITK Inhibitor Binding Kinetics
IC50
<1000±n/a nM
Citation
 Jacobsen, EJBlinn, JRSpringer, JRHockerman, SL Heterocyclic ITK inhibitors for treating inflammation and cancer US Patent  US9695200 Publication Date 7/4/2017 
Target
Name:
Tyrosine-protein kinase ITK/TSK
Synonyms:
EMT ITK_HUMAN LYK Tyrosine-protein kinase ITK Tyrosine-protein kinase Lyk
Type:
Protein
Mol. Mass.:
71839.20
Organism:
Homo sapiens (Human)
Description:
Q08881
Residue:
620
  
Inhibitor
Name:
BDBM98805
Synonyms:
US9695200, 36
Type:
Small organic molecule
Emp. Form.:
C19H20N6O
Mol. Mass.:
348.4017
SMILES:
CNc1cc(ccn1)-c1c[nH]c2ncc(cc12)N1CC(C1)NC(=O)C=C
: