Target
Tyrosine-protein kinase ITK/TSK
Ligand
BDBM98809
Substrate
Meas. Tech.
ITK Inhibitor Binding Kinetics
IC50
<1000±n/a nM
Citation
 Jacobsen, EJBlinn, JRSpringer, JRHockerman, SL Heterocyclic ITK inhibitors for treating inflammation and cancer US Patent  US9695200 Publication Date 7/4/2017 
Target
Name:
Tyrosine-protein kinase ITK/TSK
Synonyms:
EMT ITK_HUMAN LYK Tyrosine-protein kinase ITK Tyrosine-protein kinase Lyk
Type:
Protein
Mol. Mass.:
71839.20
Organism:
Homo sapiens (Human)
Description:
Q08881
Residue:
620
  
Inhibitor
Name:
BDBM98809
Synonyms:
US9695200, 38
Type:
Small organic molecule
Emp. Form.:
C27H27N5O3
Mol. Mass.:
469.535
SMILES:
COc1cc(ccn1)-c1c[nH]c2ncc(cc12)-c1cccc(NC(=O)\C=C\CN2CCOCC2)c1
: