Target
5-hydroxytryptamine receptor 3A
Ligand
BDBM50334443
Substrate
Meas. Tech.
Radioligand Binding Assay
pH
7.5±0
Ki
2±0.0 nM
Citation
 Manning, DDCioffi, CL 5-HT3 receptor modulators, methods of making, and use thereof US Patent  US8501729 Publication Date 8/6/2013 
Target
Name:
5-hydroxytryptamine receptor 3A
Synonyms:
5-HT-3 5-HT3A 5-hydroxytryptamine receptor 3 (5-HT3) 5-hydroxytryptamine receptor 3A (5HT3A) 5HT3R HTR3A Serotonin 3 receptor (5HT3) Serotonin-gated ion channel receptor | Serotonin-gated ion channel receptor 3
Type:
Protein
Mol. Mass.:
55283.27
Organism:
Homo sapiens (Human)
Description:
P46098
Residue:
478
  
Inhibitor
Name:
BDBM50334443
Synonyms:
(R)-4-fluoro-2-methyl-7-(quinuclidin-3-yl)-7,8-dihydropyrazolo[3,4,5-de]isoquinolin-6(2H)-one US8501729, 13
Type:
Small organic molecule
Emp. Form.:
C17H19FN4O
Mol. Mass.:
314.3574
SMILES:
Cn1[nH]c2cn([C@H]3CN4CCC3CC4)c(=O)c3cc(F)cc1c23
: