Target
Kallikrein-7
Ligand
BDBM100116
Substrate
EC50
>7722±n/a nM
Citation
 PubChem, PC Fluorescence Intensity-based biochemical primary high throughput dose response assay to identify activators of kallikrein-7 (K7) zymogen PubChem Bioassay (2013)[AID] 
Target
Name:
Kallikrein-7
Synonyms:
KLK7 Kallikrein 7 PRSS6 Serine protease 6 hK7 kallikrein-7 isoform 1 preproprotein
Type:
PROTEIN
Mol. Mass.:
27535.05
Organism:
Homo sapiens (Human)
Description:
ChEMBL_1469257
Residue:
253
  
Inhibitor
Name:
BDBM100116
Synonyms:
MLS001176569 cid_4962774
Type:
Small organic molecule
Emp. Form.:
C13H11NO4S
Mol. Mass.:
277.296
SMILES:
OC(=O)CCN1c2cccc3cccc(c23)S1(=O)=O
: