Target
Orexin/Hypocretin receptor type 1
Ligand
BDBM102178
Substrate
Meas. Tech.
FLIPR Assay
pH
7.4±0
Ki
2113±n/a nM
Citation
 Badiger, SBehnke, DBetschart, CChaudhari, VCotesta, SHinrichs, JHOfner, SPandit, CWagner, J Diaza-spiro[5.5]undecanes US Patent  US8530648 Publication Date 9/10/2013 
Target
Name:
Orexin/Hypocretin receptor type 1
Synonyms:
HCRTR1 OX1R_HUMAN Orexin receptor type 1 (OR 1) Orexin receptor type 1 (OX1) Orexin receptor type 1 (OxR1) | Ox1r
Type:
Protein
Mol. Mass.:
47554.50
Organism:
Homo sapiens (Human)
Description:
O43613
Residue:
425
  
Inhibitor
Name:
BDBM102178
Synonyms:
US8530648, 111
Type:
Small organic molecule
Emp. Form.:
C26H27N7O
Mol. Mass.:
453.5389
SMILES:
O=C1N(Cc2ccccc2-n2nccn2)CCCC11CCN(CC1)c1cnc2ccccc2n1
: