Target
Dihydroorotate dehydrogenase (quinone), mitochondrial
Ligand
BDBM102450
Substrate
Meas. Tech.
Inhibition Assay
pH
8±0
IC50
18±0.0 nM
Citation
 Castro Palomino Laria, JCTerricabras Belart, EErra Sola, MNavarro Romero, EFonquerna Pou, SCardus Figueras, ALozoya Toribio, ME Azabiphenylaminobenzoic acid derivatives as DHODH inhibitors US Patent  US8536165 Publication Date 9/17/2013 
Target
Name:
Dihydroorotate dehydrogenase (quinone), mitochondrial
Synonyms:
DHODH Dihydroorotate dehydrogenase Dihydroorotate dehydrogenase, mitochondrial Dihydroorotate oxidase (DHODH) | PYRD_HUMAN
Type:
Enzyme
Mol. Mass.:
42881.33
Organism:
Homo sapiens (Human)
Description:
Q02127
Residue:
395
  
Inhibitor
Name:
BDBM102450
Synonyms:
US8536165, 8
Type:
Small organic molecule
Emp. Form.:
C19H15FN2O2
Mol. Mass.:
322.333
SMILES:
Cc1ccc(Nc2cnc(c(F)c2)-c2ccccc2)c(c1)C(O)=O
: