Target
Melatonin receptor type 1A
Ligand
BDBM103452
Substrate
Meas. Tech.
Binding Assay
IC50
0.36±0.0 nM
Citation
 Uchikawa, OKoike, THoashi, YTakai, T Tricyclic compound and pharmaceutical use thereof US Patent  US8552037 Publication Date 10/8/2013 
Target
Name:
Melatonin receptor type 1A
Synonyms:
MTNR1A MTR1A_HUMAN Mel1a melatonin receptor Melatonin receptor Melatonin receptor type 1 (MT1) | Melatonin receptor type 1A
Type:
Enzyme
Mol. Mass.:
39392.94
Organism:
Homo sapiens (Human)
Description:
P48039
Residue:
350
  
Inhibitor
Name:
BDBM103452
Synonyms:
US8552037, 100
Type:
Small organic molecule
Emp. Form.:
C16H20N2O2
Mol. Mass.:
272.3422
SMILES:
CCc1nc2ccc3CCC(CCNC(C)=O)c3c2o1
: