Target
Lysine-specific demethylase 4E
Ligand
BDBM50193145
Substrate
Meas. Tech.
In vitro Hydroxylation Assays for PHD2 (AlphaScreen)
pH
7.5±0
IC50
>2.0e+4±n/a nM
Citation
 Chowdhury, RCandela-Lena, JIChan, MCGreenald, DJYeoh, KKTian, YMMcDonough, MATumber, ARose, NRConejo-Garcia, ADemetriades, MMathavan, SKawamura, ALee, MKvan Eeden, FPugh, CWRatcliffe, PJSchofield, CJ Selective Small Molecule Probes for the Hypoxia Inducible Factor (HIF) Prolyl Hydroxylases. ACS Chem Biol 8:1488-96 (2013)  
Target
Name:
Lysine-specific demethylase 4E
Synonyms:
2-OG-Dependent Histone Demethylase JMJD2E Jumonji domain-containing protein 2E (JMJD2E) KDM4DL KDM4E_HUMAN Lysine-specific demethylase 4E | Lysine-specific demethylase 4E (KDM4E)
Type:
Enzyme
Mol. Mass.:
56815.71
Organism:
Homo sapiens (Human)
Description:
B2RXH2
Residue:
506
  
Inhibitor
Name:
BDBM50193145
Synonyms:
2-(1-chloro-4-hydroxyisoquinoline-3-carboxamido)acetic acid Isoquinoline 3 | N-[(1-CHLORO-4-HYDROXYISOQUINOLIN-3-YL)CARBONYL]GLYCINE
Type:
Small organic molecule
Emp. Form.:
C12H9ClN2O4
Mol. Mass.:
280.664
SMILES:
OC(=O)CNC(=O)c1nc(Cl)c2ccccc2c1O
: