Target
3-phosphoinositide-dependent protein kinase 1
Ligand
BDBM50184999
Substrate
Meas. Tech.
Inhibitory Activity Assay
IC50
1520±n/a nM
Citation
 Sestito, SDaniele, SMartini, CRapposelli, SPuricelli, G 2-oxo-1,2-dihydropyridine-3-carboxamide compounds and their use as inhibitors of PDK1 US Patent  US10351548 Publication Date 7/16/2019 
Target
Name:
3-phosphoinositide-dependent protein kinase 1
Synonyms:
3-Phosphoinositide-Dependent Protein Kinase 1 (PDK1) 3-phosphoinositide-dependent protein kinase 1 3-phosphoinositide-dependent protein kinase 1 (PDK-1) Isoform 2 of 3-phosphoinositide-dependent protein kinase 1 PDPK1 Phosphoinositide-dependent protein kinase 1 (PDK1) hPDK1
Type:
Enzyme
Mol. Mass.:
63157.65
Organism:
Homo sapiens (Human)
Description:
O15530
Residue:
556
  
Inhibitor
Name:
BDBM50184999
Synonyms:
CHEMBL3823622 | US10351548, Compound SA23
Type:
Small organic molecule
Emp. Form.:
C33H24F2N6O4
Mol. Mass.:
606.5783
SMILES:
Fc1ccc(Cn2cccc(C(=O)N[C@@H](C(=O)Nc3ccc4NC(=O)\C(=C/c5ncc[nH]5)c4c3)c3ccccc3)c2=O)cc1F
: