Target
Coagulation factor IX
Ligand
BDBM405996
Substrate
Meas. Tech.
TBD
IC50
0.791±n/a nM
Citation
 Meng, DLi, HYang, MRuiz, MDewnani, SVJian, TParker, Jr., DLZhang, TCampeau, LWood, HBXu, JBerger, RWu, JYOrr, RKWalsh, SPHarper, B Factor IXa inhibitors US Patent  US10351558 Publication Date 7/16/2019 
Target
Name:
Coagulation factor IX
Synonyms:
Christmas factor Coagulation factor IX/VIII Coagulation factor IXa heavy chain F9 Factor IX Factor IXa (fIXa) Plasma thromboplastin component
Type:
Enzyme
Mol. Mass.:
51768.83
Organism:
Homo sapiens (Human)
Description:
P00740
Residue:
461
  
Inhibitor
Name:
BDBM405996
Synonyms:
US10351558, Example 171
Type:
Small organic molecule
Emp. Form.:
C30H25ClFN5O3
Mol. Mass.:
558.003
SMILES:
Cc1ncn(n1)-c1ccc(C(=O)N[C@@]2(CCc3c(C(O)=O)c4cc(C)ccc4n3C2)c2cccc(F)c2)c(Cl)c1
: