Target
Ectonucleotide pyrophosphatase/phosphodiesterase family member 2
Ligand
BDBM103971
Substrate
Meas. Tech.
ATX Inhibitory Selectivity Test
IC50
260±0.0 nM
Citation
 Kawaguchi, MOkabe, TOkudaira, SNishimasu, HIshitani, RKojima, HNureki, OAoki, JNagano, T Screening and X-ray crystal structure-based optimization of autotaxin (ENPP2) inhibitors, using a newly developed fluorescence probe. ACS Chem Biol 8:1713-21 (2013)  
Target
Name:
Ectonucleotide pyrophosphatase/phosphodiesterase family member 2
Synonyms:
Autotaxin ENPP2_MOUSE Ectonucleotide pyrophosphatase/phosphodiesterase family member 2 Npps2 | Pdnp2
Type:
PROTEIN
Mol. Mass.:
98896.47
Organism:
Mus musculus
Description:
Residue:
862
  
Inhibitor
Name:
BDBM103971
Synonyms:
Monosubstituted aryl-Me ATX inhibitor 9
Type:
Small organic molecule
Emp. Form.:
C17H15F6N3OS
Mol. Mass.:
423.376
SMILES:
CN1CCN(CC1)C1=NC(=O)\C(S1)=C\c1cc(cc(c1)C(F)(F)F)C(F)(F)F
: