Target
AP2-associated protein kinase 1
Ligand
BDBM311382
Substrate
Meas. Tech.
AAK1 Kinase Assay
IC50
0.390±n/a nM
Citation
 Luo, G Biaryl kinase inhibitors US Patent  US10351563 Publication Date 7/16/2019 
Target
Name:
AP2-associated protein kinase 1
Synonyms:
AAK1 Adaptor-associated kinase 1 | KIAA1048
Type:
PROTEIN
Mol. Mass.:
103884.23
Organism:
Homo sapiens (Human)
Description:
ChEMBL_774569
Residue:
961
  
Inhibitor
Name:
BDBM311382
Synonyms:
(S)-1-((4-chloro-6-(6-chloroquinolin-4-yl)pyridin-3-yl)oxy)-2,4-dimethylpentan-2-amine US10351563, Example 239 US10723734, Example 239 US9902722, Example 239
Type:
Small organic molecule
Emp. Form.:
C21H23Cl2N3O
Mol. Mass.:
404.333
SMILES:
CC(C)C[C@](C)(N)COc1cnc(cc1Cl)-c1ccnc2ccc(Cl)cc12
: