Target
Serine/threonine-protein kinase pim-1
Ligand
BDBM104256
Substrate
Meas. Tech.
PIM-1 Enzyme Assay
pH
7.4±0
Temperature
295.15±0 K
IC50
1.6±0.0 nM
Citation
 Allen, SCeleste, LLDavis, TGDeLisle, RKGreschuk, JMGross, SDHicken, EJJackson, LJKallan, NCLyssikatos, JPMarmsater, FPMunson, MCPheneger, JRast, BRobinson, JESchlachter, STTopalov, GTWright, ADZhao, Q Triazolopyridine compounds as PIM kinase inhibitors US Patent  US8575145 Publication Date 11/5/2013 
Target
Name:
Serine/threonine-protein kinase pim-1
Synonyms:
PIM-1 Kinase PIM1_HUMAN Serine/threonine-protein kinase (PIM1) Serine/threonine-protein kinase PIM1 | Serine/threonine-protein kinase pim-1 (PIM1)
Type:
Protein
Mol. Mass.:
35681.82
Organism:
Homo sapiens (Human)
Description:
P11309
Residue:
313
  
Inhibitor
Name:
BDBM104256
Synonyms:
US8575145, 133
Type:
Small organic molecule
Emp. Form.:
C21H20FN5O
Mol. Mass.:
377.4148
SMILES:
FC1(COc2cccc3ccc(nc23)-c2nnc3ccccn23)CCCNC1
: