Target
3-phosphoinositide-dependent protein kinase 1
Ligand
BDBM105394
Substrate
Meas. Tech.
Kinase Assay
IC50
229±0.0 nM
Citation
 Engelhardt, HKofink, CMcConnell, D Chemical compounds US Patent  US8575203 Publication Date 11/5/2013 
Target
Name:
3-phosphoinositide-dependent protein kinase 1
Synonyms:
3-Phosphoinositide-Dependent Protein Kinase 1 (PDK1) 3-phosphoinositide-dependent protein kinase 1 3-phosphoinositide-dependent protein kinase 1 (PDK-1) Isoform 2 of 3-phosphoinositide-dependent protein kinase 1 PDPK1 Phosphoinositide-dependent protein kinase 1 (PDK1) hPDK1
Type:
Enzyme
Mol. Mass.:
63157.65
Organism:
Homo sapiens (Human)
Description:
O15530
Residue:
556
  
Inhibitor
Name:
BDBM105394
Synonyms:
US8575203, II-10
Type:
Small organic molecule
Emp. Form.:
C27H25F2N7O2
Mol. Mass.:
517.5299
SMILES:
CN(C)CCNc1ncnc2ccc(cc12)C#CCNC(=O)c1cncn(Cc2ccc(F)c(F)c2)c1=O
: