Target
D(2) dopamine receptor
Ligand
BDBM106440
Substrate
Meas. Tech.
Radioligand Binding Assay
Ki
461±0.0 nM
Citation
 Gobbi, LRodriguez Sarmiento, RMWichmann, J Anellated pyridine compounds US Patent  US8586579 Publication Date 11/19/2013 
Target
Name:
D(2) dopamine receptor
Synonyms:
D(2) dopamine receptor DOPAMINE D2 Long DRD2 Dopamine D2 receptor Dopamine D2 receptor (D2R) Dopamine2-like | d2
Type:
Cell-surface receptors
Mol. Mass.:
50647.10
Organism:
Homo sapiens (Human)
Description:
P14416
Residue:
443
  
Inhibitor
Name:
BDBM106440
Synonyms:
US8586579, 29
Type:
Small organic molecule
Emp. Form.:
C29H33N5O2
Mol. Mass.:
483.6046
SMILES:
O=C(N[C@H]1CC[C@H](CCN2CCN(CC2)c2nccc3occc23)CC1)c1ccnc2ccccc12
: