Target
D(2) dopamine receptor
Ligand
BDBM106539
Substrate
Meas. Tech.
Radioligand Binding Assay
Ki
500.6±0.0 nM
Citation
 Gobbi, LRodriguez Sarmiento, RMWichmann, J Anellated pyridine compounds US Patent  US8586579 Publication Date 11/19/2013 
Target
Name:
D(2) dopamine receptor
Synonyms:
D(2) dopamine receptor DOPAMINE D2 Long DRD2 Dopamine D2 receptor Dopamine D2 receptor (D2R) Dopamine2-like | d2
Type:
Cell-surface receptors
Mol. Mass.:
50647.10
Organism:
Homo sapiens (Human)
Description:
P14416
Residue:
443
  
Inhibitor
Name:
BDBM106539
Synonyms:
US8586579, 155
Type:
Small organic molecule
Emp. Form.:
C29H35N5O2
Mol. Mass.:
485.6205
SMILES:
O=C(N[C@H]1CC[C@H](CCN2CCN(CC2)c2nccc3OCCc23)CC1)c1ccc2ncccc2c1
: