Target
D(3) dopamine receptor
Ligand
BDBM106440
Substrate
Meas. Tech.
Radioligand Binding Assay
Ki
23.2±0.0 nM
Citation
 Gobbi, LRodriguez Sarmiento, RMWichmann, J Anellated pyridine compounds US Patent  US8586579 Publication Date 11/19/2013 
Target
Name:
D(3) dopamine receptor
Synonyms:
DOPAMINE D3 DRD3_HUMAN Dopamine D3 receptor (D3) Dopamine receptor Dopamine receptor D3
Type:
Mol. Mass.:
44243.43
Organism:
Homo sapiens (Human)
Description:
Residue:
400
  
Inhibitor
Name:
BDBM106440
Synonyms:
US8586579, 29
Type:
Small organic molecule
Emp. Form.:
C29H33N5O2
Mol. Mass.:
483.6046
SMILES:
O=C(N[C@H]1CC[C@H](CCN2CCN(CC2)c2nccc3occc23)CC1)c1ccnc2ccccc12
: