Target
5-hydroxytryptamine receptor 2A
Ligand
BDBM106539
Substrate
Meas. Tech.
Radioligand Binding Assay
Ki
23.2±0.0 nM
Citation
 Gobbi, LRodriguez Sarmiento, RMWichmann, J Anellated pyridine compounds US Patent  US8586579 Publication Date 11/19/2013 
Target
Name:
5-hydroxytryptamine receptor 2A
Synonyms:
5-HT-2 5-HT2A 5-hydroxytryptamine receptor 2A (5HT-2A) 5HT2A_HUMAN HTR2A | Serotonin receptor 2A
Type:
undefined
Mol. Mass.:
52607.65
Organism:
Homo sapiens (Human)
Description:
P28223
Residue:
471
  
Inhibitor
Name:
BDBM106539
Synonyms:
US8586579, 155
Type:
Small organic molecule
Emp. Form.:
C29H35N5O2
Mol. Mass.:
485.6205
SMILES:
O=C(N[C@H]1CC[C@H](CCN2CCN(CC2)c2nccc3OCCc23)CC1)c1ccc2ncccc2c1
: