Target
Kininogen-1
Ligand
BDBM107183
Substrate
Meas. Tech.
Binding Assay
Ki
458.0±n/a nM
Citation
 Aebi, JBinggeli, AHertel, CKonkar, AAKuehne, HKuhn, BMaerki, HPWang, H Aryl-benzocycloalkyl amide derivatives US Patent  US8592426 Publication Date 11/26/2013 
Target
Name:
Kininogen-1
Synonyms:
BDK KNG KNG1_HUMAN
Type:
Enzyme
Mol. Mass.:
71962.11
Organism:
Homo sapiens (Human)
Description:
P01042
Residue:
644
  
Inhibitor
Name:
BDBM107183
Synonyms:
US8592426, 32
Type:
Small organic molecule
Emp. Form.:
C22H19ClF2N4O2
Mol. Mass.:
444.862
SMILES:
Cc1nc(no1)-c1c(F)cc(Cl)cc1-c1cc2CCC(NC(=O)C3(N)CC3)c2c(F)c1
: