Target
Metabotropic glutamate receptor 5
Ligand
BDBM107242
Substrate
Meas. Tech.
Cell Based Assay
IC50
6600±0 nM
Citation
 Conn, PJLindsley, CWEmmitte, KAWeaver, CDRodriguez, ALFelts, ASJones, CKBates, BS Substituted heteroarylamide analogs as mGluR5 negative allosteric modulators and methods of making and using the same US Patent  US8598345 Publication Date 12/3/2013 
Target
Name:
Metabotropic glutamate receptor 5
Synonyms:
GRM5_RAT Grm5 Mglur5 metabotropic glutamate 5/1-C metabotropic glutamate 5a
Type:
Enzyme
Mol. Mass.:
131900.14
Organism:
Rattus norvegicus (Rat)
Description:
P31424
Residue:
1203
  
Inhibitor
Name:
BDBM107242
Synonyms:
US8598345, 199 | US8598345, Table 1-28/2-3
Type:
Small organic molecule
Emp. Form.:
C15H12N4O2S
Mol. Mass.:
312.346
SMILES:
Cc1csc(NC(=O)c2cncc(Oc3cccnc3)c2)n1
: