Target
Cytochrome P450 3A4
Ligand
BDBM50353392
Substrate
Meas. Tech.
Biological Assay Example 6
Temperature
310.15±n/a K
IC50
7.0e+3±n/a nM
Comments
extracted
Citation
 Claremon, DAZhuang, LLeftheris, KTice, CMYe, YSingh, SBHimmelsbach, F Cyclic inhibitors of 11BETA-hydroxysteroid dehydrogenase 1 US Patent  US8592410 Publication Date 11/26/2013 
Target
Name:
Cytochrome P450 3A4
Synonyms:
Albendazole monooxygenase CP3A4_HUMAN CYP3A4 CYPIIIA4 Cytochrome P450 3A4 (CYP3A4) Nifedipine oxidase Taurochenodeoxycholate 6-alpha-hydroxylase
Type:
Enzyme
Mol. Mass.:
57349.57
Organism:
Homo sapiens (Human)
Description:
Residue:
503
  
Inhibitor
Name:
BDBM50353392
Synonyms:
CHEMBL1829761 US8592410, Comparator 9 | US8598163, 67
Type:
Small organic molecule
Emp. Form.:
C27H28FNO3
Mol. Mass.:
433.5145
SMILES:
C[C@H](N1CC[C@@](CCCO)(OC1=O)c1ccccc1)c1ccc(cc1)-c1ccc(F)cc1
: