Target
11-beta-hydroxysteroid dehydrogenase 1
Ligand
BDBM50353392
Substrate
Meas. Tech.
Biological Assay Example 4
IC50
11.86±0.0 nM
Citation
 Renz, MSchuehle, MXu, Z Cyclic inhibitors of 11beta-hydroxysteroid dehydrogenase 1 US Patent  US8575157 Publication Date 11/5/2013 
Target
Name:
11-beta-hydroxysteroid dehydrogenase 1
Synonyms:
11-DH 11-beta-Hydroxysteroid Dehydrogenase 1 (11-beta-HSD1) 11-beta-hydroxysteroid dehydrogenase 1 (11HSD1) Corticosteroid 11-beta-dehydrogenase isozyme 1 (11-beta-HSD-1) Corticosteroid 11-beta-dehydrogenase isozyme 1 (11beta-HSD1) HSD11 HSD11L | SDR26C1
Type:
Enzyme
Mol. Mass.:
32409.16
Organism:
Homo sapiens (Human)
Description:
P28845
Residue:
292
  
Inhibitor
Name:
BDBM50353392
Synonyms:
CHEMBL1829761 US8592410, Comparator 9 | US8598163, 67
Type:
Small organic molecule
Emp. Form.:
C27H28FNO3
Mol. Mass.:
433.5145
SMILES:
C[C@H](N1CC[C@@](CCCO)(OC1=O)c1ccccc1)c1ccc(cc1)-c1ccc(F)cc1
: