Target
Secreted chorismate mutase
Ligand
BDBM108067
Substrate
Meas. Tech.
CM Assay
Temperature
310.15±n/a K
IC50
9.656e+4± 5.20e+3 nM
Comments
extracted
Citation
 Jeankumar, VUAlokam, RSridevi, JPSuryadevara, PMatikonda, SSPeddi, SSahithi, SAlvala, MYogeeswari, PSriram, D Discovery and Structure Optimization of a Series of Isatin Derivatives as Mycobacterium tuberculosis Chorismate Mutase Inhibitors. Chem Biol Drug Des 83:498-506 (2014)  
Target
Name:
Secreted chorismate mutase
Synonyms:
Chorismate mutase (CM) Chorismate mutase-related protein | SCMU_MYCTU
Type:
Protein
Mol. Mass.:
21942.03
Organism:
Mycobacterium tuberculosis H37Rv
Description:
Residue:
199
  
Inhibitor
Name:
BDBM108067
Synonyms:
1‐(prop‐2‐en‐1‐yl)indole‐2,3‐dione (Compound 5)
Type:
Small organic molecule
Emp. Form.:
C11H9NO2
Mol. Mass.:
187.1947
SMILES:
C=CCN1C(=O)C(=O)c2ccccc12
: