Target
Secreted chorismate mutase
Ligand
BDBM22793
Substrate
Meas. Tech.
CM Assay
Temperature
310.15±n/a K
IC50
2.330e+4± 2.00e+3 nM
Comments
extracted
Citation
 Jeankumar, VUAlokam, RSridevi, JPSuryadevara, PMatikonda, SSPeddi, SSahithi, SAlvala, MYogeeswari, PSriram, D Discovery and Structure Optimization of a Series of Isatin Derivatives as Mycobacterium tuberculosis Chorismate Mutase Inhibitors. Chem Biol Drug Des 83:498-506 (2014)  
Target
Name:
Secreted chorismate mutase
Synonyms:
Chorismate mutase (CM) Chorismate mutase-related protein | SCMU_MYCTU
Type:
Protein
Mol. Mass.:
21942.03
Organism:
Mycobacterium tuberculosis H37Rv
Description:
Residue:
199
  
Inhibitor
Name:
BDBM22793
Synonyms:
1‐phenylindole‐2,3‐dione (Compound 6) Isatin-based compound, 13
Type:
Small organic molecule
Emp. Form.:
C14H9NO2
Mol. Mass.:
223.2268
SMILES:
O=C1N(c2ccccc2C1=O)c1ccccc1
: