Target
Secreted chorismate mutase
Ligand
BDBM22787
Substrate
Meas. Tech.
CM Assay
Temperature
310.15±n/a K
IC50
9.9e+2± 1.4e+2 nM
Comments
extracted
Citation
 Jeankumar, VUAlokam, RSridevi, JPSuryadevara, PMatikonda, SSPeddi, SSahithi, SAlvala, MYogeeswari, PSriram, D Discovery and Structure Optimization of a Series of Isatin Derivatives as Mycobacterium tuberculosis Chorismate Mutase Inhibitors. Chem Biol Drug Des 83:498-506 (2014)  
Target
Name:
Secreted chorismate mutase
Synonyms:
Chorismate mutase (CM) Chorismate mutase-related protein | SCMU_MYCTU
Type:
Protein
Mol. Mass.:
21942.03
Organism:
Mycobacterium tuberculosis H37Rv
Description:
Residue:
199
  
Inhibitor
Name:
BDBM22787
Synonyms:
1-acetyl-2,3-dihydro-1H-indole-2,3-dione Isatin-based compound, 7
Type:
Small organic molecule
Emp. Form.:
C10H7NO3
Mol. Mass.:
189.1675
SMILES:
CC(=O)N1C(=O)C(=O)c2ccccc12
: