Target
Secreted chorismate mutase
Ligand
BDBM108074
Substrate
Meas. Tech.
CM Assay
Temperature
310.15±n/a K
IC50
>1.00e+5±n/a nM
Comments
extracted
Citation
 Jeankumar, VUAlokam, RSridevi, JPSuryadevara, PMatikonda, SSPeddi, SSahithi, SAlvala, MYogeeswari, PSriram, D Discovery and Structure Optimization of a Series of Isatin Derivatives as Mycobacterium tuberculosis Chorismate Mutase Inhibitors. Chem Biol Drug Des 83:498-506 (2014)  
Target
Name:
Secreted chorismate mutase
Synonyms:
Chorismate mutase (CM) Chorismate mutase-related protein | SCMU_MYCTU
Type:
Protein
Mol. Mass.:
21942.03
Organism:
Mycobacterium tuberculosis H37Rv
Description:
Residue:
199
  
Inhibitor
Name:
BDBM108074
Synonyms:
(3Z)‐3‐[(6‐nitro‐1,3‐benzothiazol‐2‐yl)imino]‐1H‐ indol‐2‐one (Compound 14)
Type:
Small organic molecule
Emp. Form.:
C15H8N4O3S
Mol. Mass.:
324.314
SMILES:
[O-][N+](=O)c1ccc2nc(\N=C3/C(=O)Nc4ccccc34)sc2c1
: