Target
Secreted chorismate mutase
Ligand
BDBM108078
Substrate
Meas. Tech.
CM Assay
Temperature
310.15±n/a K
IC50
3.990e+4± 2.80e+3 nM
Comments
extracted
Citation
 Jeankumar, VUAlokam, RSridevi, JPSuryadevara, PMatikonda, SSPeddi, SSahithi, SAlvala, MYogeeswari, PSriram, D Discovery and Structure Optimization of a Series of Isatin Derivatives as Mycobacterium tuberculosis Chorismate Mutase Inhibitors. Chem Biol Drug Des 83:498-506 (2014)  
Target
Name:
Secreted chorismate mutase
Synonyms:
Chorismate mutase (CM) Chorismate mutase-related protein | SCMU_MYCTU
Type:
Protein
Mol. Mass.:
21942.03
Organism:
Mycobacterium tuberculosis H37Rv
Description:
Residue:
199
  
Inhibitor
Name:
BDBM108078
Synonyms:
5‐(piperazin‐1‐yl)‐1H‐indole‐2,3‐dione (Compound 19)
Type:
Small organic molecule
Emp. Form.:
C12H13N3O2
Mol. Mass.:
231.2505
SMILES:
O=C1Nc2ccc(cc2C1=O)N1CCNCC1
: