Target
Secreted chorismate mutase
Ligand
BDBM108084
Substrate
Meas. Tech.
CM Assay
Temperature
310.15±n/a K
IC50
9.3e+2± 1.0e+2 nM
Comments
extracted
Citation
 Jeankumar, VUAlokam, RSridevi, JPSuryadevara, PMatikonda, SSPeddi, SSahithi, SAlvala, MYogeeswari, PSriram, D Discovery and Structure Optimization of a Series of Isatin Derivatives as Mycobacterium tuberculosis Chorismate Mutase Inhibitors. Chem Biol Drug Des 83:498-506 (2014)  
Target
Name:
Secreted chorismate mutase
Synonyms:
Chorismate mutase (CM) Chorismate mutase-related protein | SCMU_MYCTU
Type:
Protein
Mol. Mass.:
21942.03
Organism:
Mycobacterium tuberculosis H37Rv
Description:
Residue:
199
  
Inhibitor
Name:
BDBM108084
Synonyms:
3-((5-nitrothiophen-2-yl)methylene)indolin-2-one (Compound 25)
Type:
Small organic molecule
Emp. Form.:
C13H8N2O3S
Mol. Mass.:
272.279
SMILES:
[O-][N+](=O)c1ccc(\C=C2/C(=O)Nc3ccccc23)s1
: