Target
Adenosine receptor A2a
Ligand
BDBM110152
Substrate
Ki
>1e+3±n/a nM
Citation
 Van der Walt, MMTerre'Blanche, GPetzer, ALourens, ACPetzer, JP The adenosine A(2A) antagonistic properties of selected C8-substituted xanthines. Bioorg Chem 49:49-58 (2013)  
Target
Name:
Adenosine receptor A2a
Synonyms:
AA2AR_RAT Adenosine A2 receptor Adenosine Receptors A2a (A2a) Adenosine receptors A2a Rat striatal adenosine A2a receptor
Type:
G Protein-Coupled Receptor (GPCR)
Mol. Mass.:
45015.65
Organism:
Rattus norvegicus (rat)
Description:
Rat A2A receptors expressed in CHO cells.
Residue:
410
  
Inhibitor
Name:
BDBM110152
Synonyms:
(E)-8-(4-Chlorostyryl)-1,3,7-triethylxanthine (7b)
Type:
Small organic molecule
Emp. Form.:
C19H21ClN4O2
Mol. Mass.:
372.849
SMILES:
CCn1c(\C=C\c2ccc(Cl)cc2)nc2n(CC)c(=O)n(CC)c(=O)c12
: