Target
Tyrosine-protein kinase CSK
Ligand
BDBM110215
Substrate
Meas. Tech.
c-Src Kinase Inhibitory Activity Assay
pH
7.5±n/a
Temperature
298.15±n/a K
IC50
2.01e+4±n/a nM
Comments
extracted
Citation
 Chand, KPrasad, STiwari, RKShirazi, ANKumar, SParang, KSharma, SK Synthesis and evaluation of c-Src kinase inhibitory activity of pyridin-2(1H)-one derivatives. Bioorg Chem 53:75-82 (2014)  
Target
Name:
Tyrosine-protein kinase CSK
Synonyms:
C-SRC kinase CSK Protein-tyrosine kinase CYL | Tyrosine Kinase CSK
Type:
Tyrosine-protein kinase
Mol. Mass.:
50707.30
Organism:
Homo sapiens (Human)
Description:
P41240
Residue:
450
  
Inhibitor
Name:
BDBM110215
Synonyms:
(E)-1-Cyclohexyl-5-[(cyclohexylimino)(2-hydroxyphenyl) methyl]pyridin-2(1H)-one (45)
Type:
Small organic molecule
Emp. Form.:
C24H30N2O2
Mol. Mass.:
378.5072
SMILES:
Oc1ccccc1\C(=N\C1CCCCC1)c1ccc(=O)n(c1)C1CCCCC1
: