Target
3-phosphoinositide-dependent protein kinase 1 [51-359]
Ligand
BDBM281949
Substrate
Meas. Tech.
PDK1 kinase assay
IC50
<100±n/a nM
Citation
 Arndt, JChan, TGuckian, KKumaravel, GLee, WLin, EYScott, DSun, LThomas, Jvan Vloten, KWang, DZhang, LErlanson, D Heterocyclic compounds useful as PDK1 inhibitors US Patent  US10030016 Publication Date 7/24/2018 
Target
Name:
3-phosphoinositide-dependent protein kinase 1 [51-359]
Synonyms:
3-Phosphoinositide-Dependent Protein Kinase 1 (PDK1) 3-phosphoinositide-dependent protein kinase 1 (aa 51-359) PDK1 (aa 51-359) PDPK1_HUMAN | hPDK1
Type:
Enzyme Catalytic Domain
Mol. Mass.:
35302.26
Organism:
Homo sapiens (Human)
Description:
O15530[51-359]
Residue:
309
  
Inhibitor
Name:
BDBM281949
Synonyms:
N-[(S)-(1-(3,4-Difluoro- phenyl)-ethyl]-2-({5- [4-(oxetan-3-ylamino)- quinazolin-6-yl]- thiophen-2-ylmethyl}- amino)-nicotinamide | US10030016, Example 4.35
Type:
Small organic molecule
Emp. Form.:
C30H26F2N6O2S
Mol. Mass.:
572.628
SMILES:
C[C@H](NC(=O)c1cccnc1NCc1ccc(s1)-c1ccc2ncnc(NC3COC3)c2c1)c1ccc(F)c(F)c1
: