Target
Serine/threonine-protein kinase pim-1
Ligand
BDBM110750
Substrate
Meas. Tech.
Pim Kinase Binding Activity
pH
7.2±n/a
Ki
0.008±n/a nM
Comments
extracted
Citation
 Hodges, AJMatteucci, MSharpe, ASun, MWang, XTsui, VH Pyrazol-4-yl-heterocyclyl-carboxamide compounds and methods of use US Patent  US8614206 Publication Date 12/24/2013 
Target
Name:
Serine/threonine-protein kinase pim-1
Synonyms:
PIM-1 Kinase PIM1_HUMAN Serine/threonine-protein kinase (PIM1) Serine/threonine-protein kinase PIM1 | Serine/threonine-protein kinase pim-1 (PIM1)
Type:
Protein
Mol. Mass.:
35681.82
Organism:
Homo sapiens (Human)
Description:
P11309
Residue:
313
  
Inhibitor
Name:
BDBM110750
Synonyms:
US8614206, 283
Type:
Small organic molecule
Emp. Form.:
C20H21F4N7OS
Mol. Mass.:
483.486
SMILES:
Cn1ncc(NC(=O)c2nc(sc2N)-c2cc(F)ccc2F)c1N1CC[C@@H](N)CC(F)(F)C1
: